{"text_format":"1","workbook":"xlsx","n_sheets":6,"sheets":["Användarguide","Indata och beräkning","EC-beräkning","Resultat","Data","Fördjupning med ekvationer"],"not_rendered":{"charts":0,"images":6,"macros":1,"external_links":0,"defined_names":83,"comments":2,"pivot_tables":0},"unopened":[],"bounds":{"document_bytes":16777216,"sheet_cells":100000,"rows_first":2000,"rows_last":500,"rows_between":2000,"halvings":0,"cell_chars":16384,"cell_head_chars":4096},"cells_cut":0,"cells_raw":0,"read":"whole","date_system":"1900"}

{"sheet":"Användarguide","index":0,"n_rows":95,"n_cols":18,"rows_kept":95,"cut":false,"hidden":false,"merged":[]}
[null,null,null,null,null,null,null,null,null,null,null,null,null,null,null,null,"v1.1"]
[]
[]
[null,null,null,null,null,null,null,null,null,null,null,null,null,null,null,null,null,"Klicka här för att komma till STEMFS 2025:2"]
[]
[]
[]
[]
[]
[]
[]
[]
[]
[null,null,null,null,null,null,null,null,null,null,null,null,null,null,null,null,null,"Klicka här för att komma till STEMFS 2025:2"]
[]
[]
[]
[]
[]
[]
[]
[]
[]
[]
[]
[]
[]
[]
[]
[]
{"$rows_left_out":66}
{"sheet":"Indata och beräkning","index":1,"n_rows":114,"n_cols":9,"rows_kept":114,"cut":false,"hidden":false,"merged":[[56,2,58,2],[54,2,55,2],[51,2,52,2],[37,2,42,2],[43,2,45,2]]}
[null,null,null,null,"?"]
[null,null,null,"Grunddata",{"$f":"IF(E4=\"Fast\",\"Biobränsle\",IF(OR(E4=\"\",E6=\"\"),\"\",IF(AND(E4=\"Flytande\",E6=\"Motordrift\"),\"Biodrivmedel\",\"Flytande biobränsle\")))","v":""}]
[]
[null,null,null,"Bränsletyp"]
[null,null,null,"Bränsle"]
[null,null,null,"Användningsområde"]
[null,null,null,"Hållbar mängd (välj enhet i drop-down på nästa rad)",null,null,null,null,"Enheter: flytande bränslen = kg eller m3 vid 15 °C, fasta bränslen = MWh  (framräknat på det sätt som framgår av kontrollsystemet). När den hållbara mängden utgör en delmängd i ett bränsle ska andelen hållbart bränsle beräknas  utifrån de ingående komponenternas energiinnehåll. "]
[null,null,null,"Enhet för värdet på hållbar mängd"]
[null,null,null,{"$f":"\"Värmevärde [\" & Enhet_värmevärde & \"]\"","v":"Värmevärde []"},{"$f":"IF(OR(E5=\"Övriga flytande\",E5=\"Övriga fasta\"), E10, IF(Enhet_värmevärde= \"MJ/l vid 15° C\", _xlfn.XLOOKUP(E5, Data!A52:A62, Data!E52:E62), _xlfn.XLOOKUP(E5,Data!A52:A67, Data!F52:F67)))","v":{"$error":"#N/A"}},null,null,null,"Enheter: flytande bränslen = MJ/l vid 15° C eller MJ/kg."]
[null,null,null,{"$f":"\"Värmevärde (eget värde), [\" & Enhet_värmevärde_eget &\"]\"","v":"Värmevärde (eget värde), [MJ/kg]"},null,null,null,null,"Enheter: flytande bränslen = MJ/l vid 15° C eller MJ/kg."]
[null,null,null,"Densitet (eget värde), [kg/m3]",null,null,null,null,"Anges för beräkning av lagring då bränslet tillhör kategorin \"övriga flytande\" och värmevärdet anges i MJ/kg. Anges även för beräkning av Sjö-och Land-transport då bränslet tillhör någon av katgorierna \"Övriga flytande\" eller \"Övriga fasta\"."]
[null,null,null,"Metod för att beräkna växthusgasutsläppet",null,null,null,null,"Förklaring av de olika alternativen finns i fliken \"Användarguide\" rubriken \"Grunddata\"."]
[null,null,null,"Produktionskedja",null,null,null,null,"Typ av produktionskedja enligt bilaga 2–8 i STEMFS 2025:2."]
[]
[]
[null,null,null,"Beräkningens omfattning och metod"]
[]
[null,null,"Term","Omfattning och metod","Värde [g CO2eq/MJ]",null,null,null,"Valen i tabellen påverkar vilka delar av beräkningen som inkluderas. Mer information i fliken \"Användarguide\", rubriken \"Grunddata\"."]
[null,null,"Leverantörens tidigare utsläpp"]
[null,null,"Utvinning eller odling av råvaror (eec)"]
[null,null,"Bearbetning (ep)"]
[null,null,"Transport och distribution (etd)"]
[null,null,"Användning av bränslet (eu)",null,null,null,null,null,"Avser metan och lustgasutsläpp från förbränningen av bränslet. Vid valet \"Värde från Genomförandeförordningen\" blir fasta bränslen = 0,4 g CO2eq/MJ, flytande biobränslen = 0,14 g CO2eq/MJ (Kommissionens genomförandeförordning (EU) 2022/996 av den 14 juni 2022 om regler för att verifiera hållbarhet och kriterier för minskade växthusgasutsläpp och kriterier för låg risk för indirekt ändring av markanvändning)."]
[null,null,"Växthusgasutsläpp från energiomvandling (EC)","Omfattas",{"$f":"IF(D24=\"Omfattas\",IF( E103=\"\",\"Fyll i fliken EC-beräkning!\",IF(OR('EC-beräkning'!G7<>\"\",'EC-beräkning'!G8<>\"\",'EC-beräkning'!G9<>\"\"),\"Se över indata på fliken EC-beräkning\",\"\")),\"\")","v":"Fyll i fliken EC-beräkning!"},null,null,null,"EC-beräkningen ligger som en separat flik."]
[]
[null,null,"Term","Omfattning och metod","Värde [g CO2eq/MJ]"]
[null,null,"Förändringar i kollager (el)",null,null,null,null,null,"Mer information om förändrad markanvändning finns i STEMFS 2025:2."]
[null,null,"Kollager förbättrade jordbruksmetoder (esca)"]
[null,null,"Avskiljning och lagring av CO2 (eccs)",null,null,null,null,null,"Avser endast utsläpp från produktionen av bränslet, och inte infångande av CO2 från förbränning av bränslet. Fyll i hur många gram CO2eq som har avskilts."]
[null,null,"Avskiljning och ersättning av CO2 (eccr)"]
{"$rows_left_out":85}
{"sheet":"EC-beräkning","index":2,"n_rows":47,"n_cols":7,"rows_kept":47,"cut":false,"hidden":true,"merged":[[3,2,3,3],[6,1,7,1],[8,2,8,3],[19,2,19,3],[26,2,26,3],[18,2,18,3],[14,2,14,3],[15,2,15,3],[48,1,51,4],[32,4,34,5],[10,2,10,3],[11,2,11,3],[6,2,6,3],[7,2,7,3],[20,2,20,3],[21,2,21,3],[22,2,22,3],[37,1,37,3],[38,1,38,3],[32,1,32,3],[33,1,33,3],[34,1,34,3],[27,2,27,3]]}
[null,null,null,null,null,{"$f":"versionsnummer","v":"v1.1"}]
[null,"Växthusgasutsläpp från energiomvandling (EC)",null,null,{"$f":"IF(OR(ISERROR(E15),ISERROR(E16),ISERROR(E23),IF(AND(E19=\"Nej\",E20=\"\"),TRUE,FALSE)),\"Fyll i samtliga gula celler i formuläret\", \"\")","v":"Fyll i samtliga gula celler i formuläret"}]
[null,"Växthusgasutsläpp innan energiomvandling"]
[null,"Växthusgasutsläpp (E)","Utsläpp från bränslepartiet, exklusive slutlig energiomvandling.",null,{"$f":"'Indata och beräkning'!E102","v":""},"g CO2eq/MJbr."]
[]
[null,"Årlig produktion och tillförsel"]
[null,"Värmeproduktion","Mängd producerad värme från pannan (utan RGK).",null,null,"MWh",{"$f":"IF(AND($E$33=\"El\",E7>0),\"Endast elproduktion. Ta bort data för värmeproduktion på denna rad!\",\"\")","v":""}]
[null,null,"Mängd producerad värme från rökgaskondensorn (enbart RGK).",null,null,"MWh",{"$f":"IF(AND($E$33=\"El\",E8>0),\"Endast elproduktion. Ta bort data för värmeproduktion på denna rad!\",\"\")","v":""}]
[null,"Elproduktion","Mängd producerad el från pannan.",null,null,"MWh",{"$f":"IF(AND($E$33=\"Värme\",E9>0),\"Endast värmeproduktion. Ta bort data för elproduktion på denna rad!\",\"\")","v":""}]
[null,"Total produktion","Mängd producerad energi från pannan.",null,{"$f":"SUM(E7:E9)","v":0}]
[null,"Tillfört bränsle (totalt)","Mängd tillfört bränsle (fossilt och bio) till pannan.",null,null,"MWh"]
[null,"Tillfört bränsle (parti)","Mängd tillfört bränsle från det specifika partiet.",null,{"$f":"'Indata och beräkning'!E7*IF('Indata och beräkning'!E8=\"MWh\",1,IF('Indata och beräkning'!E8=\"kg\",IF('Indata och beräkning'!E5=\"Övriga flytande\",'Indata och beräkning'!E10,_xlfn.XLOOKUP('Indata och beräkning'!E5,Data!A52:A67, Data!F52:F67))/3600,IF('Indata och beräkning'!E5=\"Övriga flytande\",1000/'Indata och beräkning'!E11*'Indata och beräkning'!E10/3600,_xlfn.XLOOKUP('Indata och beräkning'!E5, Data!A52:A62, Data!E52:E62)/3600*1000/_xlfn.XLOOKUP('Indata och beräkning'!E5,Data!A52:A67, Data!D52:D67))))","v":{"$error":"#N/A"}},"MWh"]
[]
[null,"Verkningsgrad"]
[null,"ⴄh","Värmeverkningsgrad (direkt), beräknad på årsbasis.",null,{"$f":"(E7+E8)/E11","v":{"$error":"#DIV/0!"}},null,{"$f":"IFERROR(IF(E15>1, \"Verkningsgraden överstiger 100 %, detta kan vara möjligt om ni använder er av RGK, annars se över er data.\",\"\"),\"\")","v":""}]
[null,"ⴄel","Elverkningsgrad (direkt), beräknad på årsbasis.",null,{"$f":"E9/E11","v":{"$error":"#DIV/0!"}},null,{"$f":"IFERROR(IF(E16>1, \"Verkningsgraden överstiger 100 %, detta kan vara möjligt om ni använder er av RGK, annars se över er data.\",\"\"),\"\")","v":""}]
[]
[null,"Beräkning av exergin i el och värme"]
[null,null,"Värmen är överskottsvärme för uppvärmning av byggnader och understiger 150 °C."]
[null,"Th","Temperatur på nyttiggjord värme vid leveranspunkten °C.",null,null,{"$f":"IF(E19=\"Ja\",\"C°\",\"\")","v":""}]
[null,"Th","Absolut temperatur på nyttiggjord värme vid leveranspunkten (Kelvin)",null,{"$f":"IF(E19=\"Nej\",E20+273.15,\"\")","v":""},{"$f":"IF(E19=\"Nej\",\"K\",\"\")","v":""}]
[null,"T0","Omgivningstemperatur (konstant)",null,{"$f":"IF(E19=\"Nej\",273.15,\"\")","v":""},{"$f":"IF(E19=\"Nej\",\"K\",\"\")","v":""}]
[null,"Ch","Carnoteffektiviteten för värme",null,{"$f":"IF(E19=\"Ja\",0.3546,(E21-E22)/E21)","v":{"$error":"#VALUE!"}}]
[]
[]
[]
[null,"Cel"]
[null,"Cel","Exergi i elektricitet",null,1]
[]
[null,"Ch"]
{"$rows_left_out":18}
{"sheet":"Resultat","index":3,"n_rows":7,"n_cols":8,"rows_kept":7,"cut":false,"hidden":false,"merged":[]}
[null,null,null,null,null,null,{"$f":"versionsnummer","v":"v1.1"}]
[]
[]
[]
["Bränsletyp","Bränslekategori","Användningsområde","Metod för bestämmande av växthusgasutsläpp","Produktionskedja","Växthusgasutsläpp E [g CO2eq/MJ]","Växthusgasutsläpp EC [g CO2eq/MJ]","Ta ej bort"]
[{"$f":"IF(ISBLANK('Indata och beräkning'!E4),\"\", 'Indata och beräkning'!E4)","v":""},{"$f":"IF(ISBLANK('Indata och beräkning'!E5),\"\",'Indata och beräkning'!E5)","v":""},{"$f":"IF(OR('Indata och beräkning'!E6=\"Kraftvärmeproduktion\", 'Indata och beräkning'!E6=\"Kraftvärmeproduktion (fysisk ersättning av kol)\"), \"Kraftvärmeproduktion (värme)\", 'Indata och beräkning'!E6)","v":0},{"$f":"IF(ISBLANK('Indata och beräkning'!E12),\"\",'Indata och beräkning'!E12)","v":""},{"$f":"IF('Indata och beräkning'!E12 <> \"Faktiska värden\", IF(ISBLANK('Indata och beräkning'!E13),\"\",'Indata och beräkning'!E13), \"\")","v":""},{"$f":"IF('Indata och beräkning'!E6 <> \"\", 'Indata och beräkning'!E102, \"\")","v":""},{"$f":"IFERROR('Indata och beräkning'!E103, \"\")","v":""}]
[{"$f":"A6","v":""},{"$f":"B6","v":""},{"$f":"IF(OR('Indata och beräkning'!E6=\"Kraftvärmeproduktion\", 'Indata och beräkning'!E6=\"Kraftvärmeproduktion (fysisk ersättning av kol)\"), \"Kraftvärmeproduktion (el)\", \"\")","v":""},{"$f":"IF(OR('Indata och beräkning'!E6=\"Kraftvärmeproduktion\", 'Indata och beräkning'!E6=\"Kraftvärmeproduktion (fysisk ersättning av kol)\"), D6, \"\")","v":""},{"$f":"E6","v":""},{"$f":"F6","v":""},{"$f":"IFERROR('Indata och beräkning'!E104, \"\")","v":""},"Ta ej bort"]

{"sheet":"Data","index":4,"n_rows":357,"n_cols":28,"rows_kept":357,"cut":false,"hidden":false,"merged":[[1,12,2,12],[1,22,2,22],[1,6,2,6],[1,7,2,7],[1,8,2,8],[1,9,2,9],[1,10,2,10],[150,27,242,27],[130,27,131,27],[1,16,2,16],[1,13,2,13],[1,14,2,14],[1,15,2,15],[98,27,103,27],[104,27,107,27],[108,27,111,27],[116,27,117,27],[123,27,124,27],[1,27,2,27],[36,27,45,27],[76,26,84,26],[27,26,30,26],[1,1,2,1],[1,2,2,2],[1,3,2,3],[248,26,253,26],[244,26,246,26],[1,20,1,21],[1,19,2,19],[1,18,2,18],[1,17,2,17],[1,23,1,25],[1,26,2,26],[36,26,45,26],[51,26,61,26],[1,4,2,4],[1,5,2,5],[1,11,2,11]]}
[null,null,null,null,null,null,null,null,null,null,null,null,null,null,null,null,null,null,null,null,null,null,null,null,null,null,null,{"$f":"versionsnummer","v":"v1.1"}]
[null,"GWP-faktor [kg CO2eq/kg CH4]","GWP-faktor [kg CO2eq/kg N2O]","Densitet [kg/m3]","Värmevärde, LHV [MJ/l]","Värmevärde, LHV [MJ/kg]","Emissionsfaktor [g CO2eq/MJ]","Energiförlust för lagring [MJ/mån]","Volym [m3]","Avstånd [km]","Drivmedelseffektivitet [MJ/ton/km]","Lastvikt [ton]","Deplacement [ton]","eec inklusive N2O-utsläpp från mark [g CO2eq/MJ]","ep [g CO2eq/MJ]","etd [g CO2eq/MJ]","Normalvärde för  minskningen av växthusgasutsläpp [%/100]","Odling","Bearbetning","Transport och distribution","Normalvärde för  minskningen av växthusgasutsläpp [%/100]",null,"Förnybara andelar [%/100]","Fossil motsvarighet, EF respektive ECf [CO2eq/MJ]",null,null,"Källa","Kommentar"]
["Benämning",null,null,null,null,null,null,null,null,null,null,null,null,null,null,null,null,null,null,null,"Värme","El",null,"E","ECh","ECel"]
["Egenskaper bränslen"]
["GWP-faktor",25,298,null,null,null,null,null,null,null,null,null,null,null,null,null,null,null,null,null,null,null,null,null,null,null,"Naturvårdsverket (2023), Klimatklivet - Vägledning om beräkning av utsläppsminskning, https://www.naturvardsverket.se/4a6ac7/globalassets/amnen/klimat/klimatklivet/vagledning-berakna-utslappsminskning-230915.pdf [Åtkomstdatum 19 september 2024]"]
["Avsnitt i modell"]
["Bearbetning (ep), Transport och distribution (etd) - landtransport"]
["Nordisk elmix",null,null,null,null,null,{"$f":"90.4/3.6","v":25.111111111111111},null,null,null,null,null,null,null,null,null,null,null,null,null,null,null,null,null,null,null,"Sandgren, A. & Nilsson, J. (2021) SMED Rapport Nr 4 2021 Emissionsfaktor för nordisk elmix med hänsyn till import och export, https://naturvardsverket.diva-portal.org/smash/get/diva2:1540012/FULLTEXT01.pdf, [Åtkomstdatum: 13 december 2023]"]
["Svensk elmix",null,null,null,null,null,{"$f":"(26)/(3.6)","v":7.2222222222222223},null,null,null,null,null,null,null,null,null,null,null,null,null,null,null,null,null,null,null,"Kommissionens genomförandeförordning (EU) 2022/996 av den 14 juni 2022 om regler för att verifiera hållbarhet och kriterier för minskade växthusgasutsläpp och kriterier för låg risk för indirekt ändring av markanvändning , bilaga IX","Koldioxidintensitet för producerad och använd el i Sverige 2019. Genomsnitt för använd el från låg, mellan och högspänning."]
["EU-elmix",null,null,null,null,null,{"$f":"308/3.6","v":85.555555555555557},null,null,null,null,null,null,null,null,null,null,null,null,null,null,null,null,null,null,null,"Kommissionens genomförandeförordning (EU) 2022/996 av den 14 juni 2022 om regler för att verifiera hållbarhet och kriterier för minskade växthusgasutsläpp och kriterier för låg risk för indirekt ändring av markanvändning , bilaga IX","EU-27: Koldioxidintensitet för producerad och använd el i EU 2019. Genomsnitt för använd el från låg, mellan och högspänning. Värdet skiljer sig mkt från JRCs data från 2014  som är  136-150 g CO2ekv/MJel beroende på HV, MV eller LV. "]
["Bearbetning (ep)"]
["Stenkol",null,null,null,null,null,112.32,null,null,null,null,null,null,null,null,null,null,null,null,null,null,null,null,null,null,null,"Kommissionens genomförandeförordning (EU) 2022/996 av den 14 juni 2022 om regler för att verifiera hållbarhet och kriterier för minskade växthusgasutsläpp och kriterier för låg risk för indirekt ändring av markanvändning , bilaga IX"]
["Eldningsolja",null,null,null,null,null,94.2,null,null,null,null,null,null,null,null,null,null,null,null,null,null,null,null,null,null,null,"Kommissionens genomförandeförordning (EU) 2022/996 av den 14 juni 2022 om regler för att verifiera hållbarhet och kriterier för minskade växthusgasutsläpp och kriterier för låg risk för indirekt ändring av markanvändning , bilaga IX ","Tung eldningsolja."]
["Naturgas",null,null,null,null,null,66,null,null,null,null,null,null,null,null,null,null,null,null,null,null,null,null,null,null,null,"Kommissionens genomförandeförordning (EU) 2022/996 av den 14 juni 2022 om regler för att verifiera hållbarhet och kriterier för minskade växthusgasutsläpp och kriterier för låg risk för indirekt ändring av markanvändning , bilaga IX ","Naturgas (EU-mix ) tidigare baserat på naturgas (Västeuropa)."]
["Torv",null,null,null,null,null,{"$f":"106+B5*0.001+C5*0.0015","v":106.47200000000001},null,null,null,null,null,null,null,null,null,null,null,null,null,null,null,null,null,null,null,"Bilaga till kommissionens delegerade förordning (EU) om komplettering av Europaparlamentets och rådets direktiv (EU) 2018/2001 genom fastställande av ett minimitröskelvärde för minskningen av växthusgasutsläpp från återvunna kolbaserade bränslen och genom specificering av en metod för bedömningen av minskningen av växthusgasutsläpp från förnybara flytande och gasformiga drivmedel av icke-biologiskt ursprung och från återvunna kolbaserade bränslen ","Utsläppsfaktorer tidigare led för torv är 0."]
["Biobränsle - Icke förädlade",null,null,null,null,null,2.1566517157678313,null,null,null,null,null,null,null,null,null,null,null,null,null,null,null,null,null,null,null,"Gode, J. et el, (2011), Miljöfaktaboken 2011 - Uppskattade emissionsfaktorer för bränslen, el, värme och transporter, Värmeforsk, https://energiforskmedia.blob.core.windows.net/media/17907/miljoefaktaboken-2011-vaermeforskrapport-1183.pdf [Åtkomstdatum 13 december 2023]","GROT."]
["Biobränslen - Förädlade",null,null,null,null,null,0.25379999999999997,null,null,null,null,null,null,null,null,null,null,null,null,null,null,null,null,null,null,null,"Kommissionens genomförandeförordning (EU) 2022/996 av den 14 juni 2022 om regler för att verifiera hållbarhet och kriterier för minskade växthusgasutsläpp och kriterier för låg risk för indirekt ändring av markanvändning , bilaga IX ","Pellets."]
["Verksamhetsavfall",null,null,null,null,null,26.892775134158423,null,null,null,null,null,null,null,null,null,null,null,null,null,null,null,null,null,null,null,"Gode, J. et el, (2011), Miljöfaktaboken 2011 - Uppskattade emissionsfaktorer för bränslen, el, värme och transporter, Värmeforsk, https://energiforskmedia.blob.core.windows.net/media/17907/miljoefaktaboken-2011-vaermeforskrapport-1183.pdf [Åtkomstdatum 13 december 2023]","PTP = Papper, trä, plast. Uppskattade emissionsfaktorer för bränslen, el, värme och transporter."]
["Hushållsavfall",null,null,null,null,null,40.146999999999998,null,null,null,null,null,null,null,null,null,null,null,null,null,null,null,null,null,null,null,"Naturvårdsverket (2024), Emissionsfaktorer och värmevärden submission 2024, https://www.naturvardsverket.se/490983/contentassets/e5656a81bce94bf1bdb832f5cf998daf/ef-bilaga-klimat2.xlsx [Åtkomstdatum: 19 september 2024]","NVV 2021 - 40.147 gCO2 ekv /MJ för fjärrvärme el produktion. "]
["Gasol",null,null,null,null,null,65.154799999999994,null,null,null,null,null,null,null,null,null,null,null,null,null,null,null,null,null,null,null,"Naturvårdsverket (2024), Emissionsfaktorer och värmevärden submission 2024, https://www.naturvardsverket.se/490983/contentassets/e5656a81bce94bf1bdb832f5cf998daf/ef-bilaga-klimat2.xlsx [Åtkomstdatum: 19 september 2024]","Stationär förbränning av gasol (propan och butan)."]
["Transport och distribution (etd) - lagring"]
["Fjärrvärme - Sverigemedel",null,null,null,null,null,{"$f":"(70.1+59.2+53.7+52+51.4)/5/3.6","v":15.91111111111111},null,null,null,null,null,null,null,null,null,null,null,null,null,null,null,null,null,null,null,"Energiföretagen Sverige (2024), Miljövärdering av fjärrvärme, https://www.energiforetagen.se/statistik/fjarrvarmestatistik/miljovardering-av-fjarrvarme/ [Åtkomstdatum: 19 september 2024]","Fjärrvärme, genomsnittliga miljövärden för Sverige. Oljepanna antas för \"Okänt\"."]
["Eldningsolja",null,null,null,null,null,{"$f":"77.4+0.003*B5+0.0006*C5+11.6","v":89.253799999999998},null,null,null,null,null,null,null,null,null,null,null,null,null,null,null,null,null,null,null,"Bilaga till kommissionens delegerade förordning (EU) om komplettering av Europaparlamentets och rådets direktiv (EU) 2018/2001 genom fastställande av ett minimitröskelvärde för minskningen av växthusgasutsläpp från återvunna kolbaserade bränslen och genom specificering av en metod för bedömningen av minskningen av växthusgasutsläpp från förnybara flytande och gasformiga drivmedel av icke-biologiskt ursprung och från återvunna kolbaserade bränslen ","Stationär förbränning av eldningsolja (tidigare oljepanna). Inkl. standardutsläppsfaktor för stationär förbränning, samt utsläppsfaktor för bränsle i tidigare led. 77.4 g CO2/kg, 0.003 g CH4/kg, 0.0006 g NO2/kg."]
["Spillvärme",null,null,null,null,null,0,null,null,null,null,null,null,null,null,null,null,null,null,null,null,null,null,null,null,null,"Erlandsson, M. (2018), Byggnaders klimatpåverkan, timme för timme - idag och i framtiden, https://www.ivl.se/download/18.694ca0617a1de98f472d4d/1628414616722/FULLTEXT01.pdf [Åtkomstdatum 20 december 2023]","Enligt källan ingen klimatpåverkan pga det rör sig om spill."]
["Biobränsle",null,null,null,null,null,{"$f":"0.03*B5+C5*0.004+0.7","v":2.6419999999999999},null,null,null,null,null,null,null,null,null,null,null,null,null,null,null,null,null,null,null,"Bilaga till kommissionens delegerade förordning (EU) om komplettering av Europaparlamentets och rådets direktiv (EU) 2018/2001 genom fastställande av ett minimitröskelvärde för minskningen av växthusgasutsläpp från återvunna kolbaserade bränslen och genom specificering av en metod för bedömningen av minskningen av växthusgasutsläpp från förnybara flytande och gasformiga drivmedel av icke-biologiskt ursprung och från återvunna kolbaserade bränslen ","Fasta biobränslen (tidigare Fjärrvärme, biokraftvärme)."]
["Okänt",null,null,null,null,null,{"$f":"G23","v":89.253799999999998},null,null,null,null,null,null,null,null,null,null,null,null,null,null,null,null,null,null,null,null,"Antas som eldningsolja. "]
["Transport och distribution (etd) - sjötransport"]
["Eo1 (antas motsvara MGO, marin dieselolja)",null,null,null,null,{"$f":"0.0427*1000","v":42.7},90.6,null,null,null,null,null,null,null,null,null,null,null,null,null,null,null,null,null,null,null,"Europaparlamentets och rådets förordning (EU) 2023/1805 av den 13 september 2023 om användning av förnybara och koldioxidsnåla bränslen för sjötransport och om ändring av direktiv 2009/16/EG","MDO, MGO. Föreslaget standardvärde (ännu inte beslutade, EP&C, 2021). Värmevärde från ursprungskälla."]
["Eo2-6 (HFO)",null,null,null,null,{"$f":"0.0405*1000","v":40.5},91.6,null,null,null,null,null,null,null,null,null,null,null,null,null,null,null,null,null,null,null,null,"HFO. Föreslaget standardvärde (ännu inte beslutade, EP&C, 2021). Värmevärde från ursprungskälla."]
["Diesel (MDO)",null,null,null,null,{"$f":"0.0427*1000","v":42.7},90.6,null,null,null,null,null,null,null,null,null,null,null,null,null,null,null,null,null,null,null,null,"MDO. Föreslaget standardvärde (ännu inte beslutade, EP&C, 2021). Värmevärde från ursprungskälla."]
{"$rows_left_out":328}
{"sheet":"Fördjupning med ekvationer","index":5,"n_rows":56,"n_cols":19,"rows_kept":56,"cut":false,"hidden":false,"merged":[]}
[null,null,null,null,null,null,null,null,null,null,null,null,null,null,null,null,null,null,{"$f":"versionsnummer","v":"v1.1"}]
["Fördjupning"]
["Bakomliggande ekvationer till respektive beräkning"]
["Utsläpp vid bearbetning"]
[]
[]
[]
[]
[]
[]
[]
[]
[]
[]
[]
[]
[]
[]
[]
[]
[]
[]
[]
["Utsläpp vid lagring"]
[]
[]
[]
[]
[]
[]
{"$rows_left_out":26}